Reaction Details
TargetGrowth hormone secretagogue receptor type 1
LigandBDBM50019922
Substrate/Competitorn/a
Meas. Tech.ChEMBL_1361892 (CHEMBL3293067)
Ki 10±n/a nM
Citation Bhattacharya, SKAndrews, KBeveridge, RCameron, KOChen, CDunn, MFernando, DGao, HHepworth, DJackson, VMKhot, VKong, JKosa, RELapham, KLoria, PMLondregan, ATMcClure, KFOrr, STPatel, JRose, CSaenz, JStock, IAStorer, GVanVolkenburg, MVrieze, DWang, GXiao, JZhang, Y Discovery of PF-5190457, a Potent, Selective, and Orally Bioavailable Ghrelin Receptor Inverse Agonist Clinical Candidate. ACS Med Chem Lett5:474-9 (2014) 
 
Growth hormone secretagogue receptor type 1
Name:Growth hormone secretagogue receptor type 1
Type:Receptor
Mol. Mass.:41334.57
Organism:Homo sapiens (Human)
Description:Receptor binding studies use plasma membranes from LLC PK-1 cells transiently transfected with hGHSR1a.
Residue:366
BDBM50019922
NameBDBM50019922
Synonyms:CHEMBL3287214
TypeSmall organic molecule
Emp. Form.C30H32N6O2S
Mol. Mass.540.679
SMILESCc1cn2cc(CC(=O)N3CCC4(CN(C4)[C@@H]4CCc5cc(ccc45)-c4ccc(nc4)C(N)=O)CC3)nc2s1