Reaction Details
TargetPyroglutamylated RF-amide peptide receptor
LigandBDBM50019973
Substrate/Competitorn/a
Meas. Tech.ChEMBL_1363386 (CHEMBL3295521)
IC50 1000±n/a nM
Citation Nordqvist, AKristensson, LJohansson, KEIsaksson da Silva, KFex, TTyrchan, CSvensson Henriksson, ANilsson, K New Hits as Antagonists of GPR103 Identified by HTS. ACS Med Chem Lett5:527-32 (2014) 
 
Pyroglutamylated RF-amide peptide receptor
Name:Pyroglutamylated RF-amide peptide receptor
Type:Enzyme Catalytic Domain
Mol. Mass.:49508.46
Organism:Homo sapiens (Human)
Description:GPR103 0 HUMAN::Q96P65
Residue:431
BDBM50019973
NameBDBM50019973
Synonyms:CHEMBL3287824
TypeSmall organic molecule
Emp. Form.C20H24N2OS
Mol. Mass.340.482
SMILESCOc1ccc(cc1CSC1CCCC1)C(=N)Nc1ccccc1