Reaction Details
TargetPyroglutamylated RF-amide peptide receptor
LigandBDBM50019975
Substrate/Competitorn/a
Meas. Tech.ChEMBL_1363386 (CHEMBL3295521)
IC50 1585±n/a nM
Citation Nordqvist, AKristensson, LJohansson, KEIsaksson da Silva, KFex, TTyrchan, CSvensson Henriksson, ANilsson, K New Hits as Antagonists of GPR103 Identified by HTS. ACS Med Chem Lett5:527-32 (2014) 
 
Pyroglutamylated RF-amide peptide receptor
Name:Pyroglutamylated RF-amide peptide receptor
Type:Enzyme Catalytic Domain
Mol. Mass.:49508.46
Organism:Homo sapiens (Human)
Description:GPR103 0 HUMAN::Q96P65
Residue:431
BDBM50019975
NameBDBM50019975
Synonyms:CHEMBL3287826
TypeSmall organic molecule
Emp. Form.C18H22N2S2
Mol. Mass.330.511
SMILESCc1ccc(NC(=N)c2cccs2)cc1CSC1CCCC1