Reaction Details
TargetMast/stem cell growth factor receptor Kit
LigandBDBM50020310
Substrate/Competitorn/a
Meas. Tech.ChEMBL_1365409 (CHEMBL3296768)
Ki 200±n/a nM
Citation Zhang, LZheng, QYang, YZhou, HGong, XZhao, SFan, C Synthesis and in vivo SAR study of indolin-2-one-based multi-targeted inhibitors as potential anticancer agents. Eur J Med Chem82:139-51 (2014) 
 
Mast/stem cell growth factor receptor Kit
Name:Mast/stem cell growth factor receptor Kit
Type:Protein
Mol. Mass.:109869.37
Organism:Homo sapiens (Human)
Description:P10721
Residue:976
BDBM50020310
NameBDBM50020310
Synonyms:CHEMBL3288854
TypeSmall organic molecule
Emp. Form.C23H28FN5O2
Mol. Mass.425.4991
SMILESCN1CCN(CCC(=O)Nc2c(C)[nH]c(\C=C3/C(=O)Nc4ccc(F)cc34)c2C)CC1