Reaction Details
TargetPhosphorylase b kinase gamma catalytic chain, liver/testis isoform
LigandBDBM50020310
Substrate/Competitorn/a
Meas. Tech.ChEMBL_1365414 (CHEMBL3296773)
Ki 840±n/a nM
Citation Zhang, LZheng, QYang, YZhou, HGong, XZhao, SFan, C Synthesis and in vivo SAR study of indolin-2-one-based multi-targeted inhibitors as potential anticancer agents. Eur J Med Chem82:139-51 (2014) 
 
Phosphorylase b kinase gamma catalytic chain, liver/testis isoform
Name:Phosphorylase b kinase gamma catalytic chain, liver/testis isoform
Type:PROTEIN
Mol. Mass.:46440.15
Organism:Homo sapiens (Human)
Description:ChEMBL_774277
Residue:406
BDBM50020310
NameBDBM50020310
Synonyms:CHEMBL3288854
TypeSmall organic molecule
Emp. Form.C23H28FN5O2
Mol. Mass.425.4991
SMILESCN1CCN(CCC(=O)Nc2c(C)[nH]c(\C=C3/C(=O)Nc4ccc(F)cc34)c2C)CC1