Reaction Details
TargetProstaglandin E synthase
LigandBDBM50020565
Substrate/Competitorn/a
Meas. Tech.ChEMBL_1361558 (CHEMBL3294882)
IC50 1500±n/a nM
Citation Koeberle, AMuņoz, EAppendino, GBMinassi, APace, SRossi, AWeinigel, CBarz, DSautebin, LCaprioglio, DCollado, JAWerz, O SAR studies on curcumin's pro-inflammatory targets: discovery of prenylated pyrazolocurcuminoids as potent and selective novel inhibitors of 5-lipoxygenase. J Med Chem57:5638-48 (2014) 
 
Prostaglandin E synthase
Name:Prostaglandin E synthase
Type:Protein
Mol. Mass.:17112.22
Organism:Homo sapiens (Human)
Description:n/a
Residue:152
BDBM50020565
NameBDBM50020565
Synonyms:CHEMBL2392188
TypeSmall organic molecule
Emp. Form.C29H34O5
Mol. Mass.462.5773
SMILES[#6]-[#8]-c1cc(\[#6]=[#6]\[#6](=O)\[#6]=[#6]\c2cc(-[#6]\[#6]=[#6](\[#6])-[#6])c(-[#8])c(-[#8]-[#6])c2)cc(-[#6]\[#6]=[#6](/[#6])-[#6])c1-[#8]