Reaction Details
TargetPolyunsaturated fatty acid 5-lipoxygenase
LigandBDBM50020583
Substrate/Competitorn/a
Meas. Tech.ChEMBL_1361560 (CHEMBL3295127)
IC50 2300±n/a nM
Citation Koeberle, AMuņoz, EAppendino, GBMinassi, APace, SRossi, AWeinigel, CBarz, DSautebin, LCaprioglio, DCollado, JAWerz, O SAR studies on curcumin's pro-inflammatory targets: discovery of prenylated pyrazolocurcuminoids as potent and selective novel inhibitors of 5-lipoxygenase. J Med Chem57:5638-48 (2014) 
 
Polyunsaturated fatty acid 5-lipoxygenase
Name:Polyunsaturated fatty acid 5-lipoxygenase
Type:Enzyme
Mol. Mass.:77972.74
Organism:Homo sapiens (Human)
Description:Recombinant protein was purified from E. coli lysate. After ammonium sulfate precipitation and subsequent steps, the supernatant (S100) was used for 5-LO activity assay.
Residue:674
BDBM50020583
NameBDBM50020583
Synonyms:CHEMBL3290439
TypeSmall organic molecule
Emp. Form.C19H18O6
Mol. Mass.342.3426
SMILESCOc1cc(\C=C\C(=O)CC(=O)c2ccc(O)c(OC)c2)ccc1O