Reaction Details
TargetProstaglandin E synthase
LigandBDBM50067040
Substrate/Competitorn/a
Meas. Tech.ChEMBL_1361558 (CHEMBL3294882)
IC50 600±n/a nM
Citation Koeberle, AMuņoz, EAppendino, GBMinassi, APace, SRossi, AWeinigel, CBarz, DSautebin, LCaprioglio, DCollado, JAWerz, O SAR studies on curcumin's pro-inflammatory targets: discovery of prenylated pyrazolocurcuminoids as potent and selective novel inhibitors of 5-lipoxygenase. J Med Chem57:5638-48 (2014) 
 
Prostaglandin E synthase
Name:Prostaglandin E synthase
Type:Protein
Mol. Mass.:17112.22
Organism:Homo sapiens (Human)
Description:n/a
Residue:152
BDBM50067040
NameBDBM50067040
Synonyms:((E,E)-1,7-bis(4-hydroxy-3-methoxyphenyl)-1,6-heptadiene-3,5-dione) (1E,4Z,6E)-5-hydroxy-1,7-bis(4-hydroxy-3-methoxyphenyl)hepta-1,4,6-trien-3-one (1E,6E)-1,7-bis(4-hydroxy-3-methoxyphenyl)-1,6-heptadiene-3,5-dione (1Z,6E)-1,7-Bis-(4-hydroxy-3-methoxy-phenyl)-hepta-1,6-diene-3,5-dione 1,7-Bis-(4-hydroxy-3-methoxy-phenyl)-hepta-1,6-diene-3,5-dione 1,7-bis(4-hydroxy-3-methoxyphenyl)-1,6-heptadiene-3,5-dione 1,7-bis(4-hydroxy-3-methoxyphenyl)hepta-1,6-diene-3,5-dione 5-Hydroxy-1,7-bis-(4-hydroxy-3-methoxy-phenyl)-hepta-1,4,6-trien-3-one CHEMBL116438 curcumin I curcurmin | diferuloylmethane
TypeSmall organic molecule
Emp. Form.C21H20O6
Mol. Mass.368.3799
SMILESCOc1cc(C=CC(=O)CC(=O)C=Cc2ccc(O)c(OC)c2)ccc1O