Reaction Details
TargetPolyunsaturated fatty acid 5-lipoxygenase
LigandBDBM50020584
Substrate/Competitorn/a
Meas. Tech.ChEMBL_1361560 (CHEMBL3295127)
IC50 90±n/a nM
Citation Koeberle, AMuņoz, EAppendino, GBMinassi, APace, SRossi, AWeinigel, CBarz, DSautebin, LCaprioglio, DCollado, JAWerz, O SAR studies on curcumin's pro-inflammatory targets: discovery of prenylated pyrazolocurcuminoids as potent and selective novel inhibitors of 5-lipoxygenase. J Med Chem57:5638-48 (2014) 
 
Polyunsaturated fatty acid 5-lipoxygenase
Name:Polyunsaturated fatty acid 5-lipoxygenase
Type:Enzyme
Mol. Mass.:77972.74
Organism:Homo sapiens (Human)
Description:Recombinant protein was purified from E. coli lysate. After ammonium sulfate precipitation and subsequent steps, the supernatant (S100) was used for 5-LO activity assay.
Residue:674
BDBM50020584
NameBDBM50020584
Synonyms:CHEMBL2413471
TypeSmall organic molecule
Emp. Form.C19H18N2O4
Mol. Mass.338.3572
SMILESCOc1cc(\C=C\c2cc([nH]n2)-c2ccc(O)c(OC)c2)ccc1O