Reaction Details
TargetE3 ubiquitin-protein ligase Mdm2
LigandBDBM50020717
Substrate/Competitorn/a
Meas. Tech.ChEMBL_1363438 (CHEMBL3295827)
IC50 440±n/a nM
Citation Gomha, SMEldebss, TMAbdulla, MMMayhoub, AS Diphenylpyrroles: Novel p53 activators. Eur J Med Chem82:472-9 (2014) 
 
E3 ubiquitin-protein ligase Mdm2
Name:E3 ubiquitin-protein ligase Mdm2
Type:Oncoprotein
Mol. Mass.:55196.54
Organism:Homo sapiens (Human)
Description:Q00987
Residue:491
BDBM50020717
NameBDBM50020717
Synonyms:CHEMBL3291433
TypeSmall organic molecule
Emp. Form.C24H18N4OS
Mol. Mass.410.491
SMILESCc1[nH]c(c(c1-c1ccnc2[nH]c(=S)[nH]c(=O)c12)-c1ccccc1)-c1ccccc1