Reaction Details
TargetBcl-2-like protein 1
LigandBDBM50020936
Substrate/Competitorn/a
Meas. Tech.ChEMBL_1365045 (CHEMBL3291801)
IC50 4.0±n/a nM
Citation Koehler, MFBergeron, PChoo, EFLau, KNdubaku, CDudley, DGibbons, PSleebs, BERye, CSNikolakopoulos, GBui, CKulasegaram, SKersten, WJSmith, BJCzabotar, PEColman, PMHuang, DCBaell, JBWatson, KGHasvold, LTao, ZFWang, LSouers, AJElmore, SWFlygare, JAFairbrother, WJLessene, G Structure-Guided Rescaffolding of Selective Antagonists of BCL-XL. ACS Med Chem Lett5:662-7 (2014) 
 
Bcl-2-like protein 1
Name:Bcl-2-like protein 1
Type:Mitochondrion membrane; Single-pass membrane protein
Mol. Mass.:26039.60
Organism:Homo sapiens (Human)
Description:n/a
Residue:233
BDBM50020936
NameBDBM50020936
Synonyms:CHEMBL3287299
TypeSmall organic molecule
Emp. Form.C32H26N4O3S
Mol. Mass.546.639
SMILESOC(=O)c1nc(ccc1\C=C\Cc1ccccc1)N1CCc2cccc(C(=O)Nc3nc4ccccc4s3)c2C1