Reaction Details
TargetSomatostatin receptor type 3
LigandBDBM50021057
Substrate/Competitorn/a
Meas. Tech.ChEMBL_1365873 (CHEMBL3296531)
Ki 9.0±n/a nM
Citation Li, DWu, ZYu, YBall, RGGuo, LSherer, EHe, SHong, QLai, ZQi, HTruong, QYang, DXChicchi, GGTsao, KLTrusca, DTrujillo, MPachanski, MEiermann, GJHoward, ADZhou, YPZhang, BBNargund, RPHagmann, WK Diamine Derivatives as Novel Small-Molecule, Potent, and Subtype-Selective Somatostatin SST3 Receptor Agonists. ACS Med Chem Lett5:690-5 (2014) 
 
Somatostatin receptor type 3
Name:Somatostatin receptor type 3
Type:Protein
Mol. Mass.:45855.97
Organism:Homo sapiens (Human)
Description:P32745
Residue:418
BDBM50021057
NameBDBM50021057
Synonyms:CHEMBL3287647
TypeSmall organic molecule
Emp. Form.C20H22Cl2FN3O
Mol. Mass.410.313
SMILESFc1ccc(NC(=O)N[C@@H]2CCCC[C@@H]2NCc2ccc(Cl)c(Cl)c2)cc1