Reaction Details
TargetSomatostatin receptor type 3
LigandBDBM50021074
Substrate/Competitorn/a
Meas. Tech.ChEMBL_1365876 (CHEMBL3296534)
EC50 0.516000±n/a nM
Citation Li, DWu, ZYu, YBall, RGGuo, LSherer, EHe, SHong, QLai, ZQi, HTruong, QYang, DXChicchi, GGTsao, KLTrusca, DTrujillo, MPachanski, MEiermann, GJHoward, ADZhou, YPZhang, BBNargund, RPHagmann, WK Diamine Derivatives as Novel Small-Molecule, Potent, and Subtype-Selective Somatostatin SST3 Receptor Agonists. ACS Med Chem Lett5:690-5 (2014) 
 
Somatostatin receptor type 3
Name:Somatostatin receptor type 3
Type:Protein
Mol. Mass.:45855.97
Organism:Homo sapiens (Human)
Description:P32745
Residue:418
BDBM50021074
NameBDBM50021074
Synonyms:CHEMBL3287628
TypeSmall organic molecule
Emp. Form.C24H24Cl2N2O
Mol. Mass.427.366
SMILESClc1ccc(CN[C@H]2CCCC[C@H]2NC(=O)c2ccc3ccccc3c2)cc1Cl