Reaction Details
TargetSomatostatin receptor type 3
LigandBDBM50021068
Substrate/Competitorn/a
Meas. Tech.ChEMBL_1365873 (CHEMBL3296531)
Ki 90±n/a nM
Citation Li, DWu, ZYu, YBall, RGGuo, LSherer, EHe, SHong, QLai, ZQi, HTruong, QYang, DXChicchi, GGTsao, KLTrusca, DTrujillo, MPachanski, MEiermann, GJHoward, ADZhou, YPZhang, BBNargund, RPHagmann, WK Diamine Derivatives as Novel Small-Molecule, Potent, and Subtype-Selective Somatostatin SST3 Receptor Agonists. ACS Med Chem Lett5:690-5 (2014) 
 
Somatostatin receptor type 3
Name:Somatostatin receptor type 3
Type:Protein
Mol. Mass.:45855.97
Organism:Homo sapiens (Human)
Description:P32745
Residue:418
BDBM50021068
NameBDBM50021068
Synonyms:CHEMBL3287618
TypeSmall organic molecule
Emp. Form.C20H23FN2O2
Mol. Mass.342.4072
SMILESOc1cccc(CN[C@H]2CCCC[C@H]2NC(=O)c2ccc(F)cc2)c1