Reaction Details
TargetSomatostatin receptor type 3
LigandBDBM50021076
Substrate/Competitorn/a
Meas. Tech.ChEMBL_1365873 (CHEMBL3296531)
Ki 151±n/a nM
Citation Li, DWu, ZYu, YBall, RGGuo, LSherer, EHe, SHong, QLai, ZQi, HTruong, QYang, DXChicchi, GGTsao, KLTrusca, DTrujillo, MPachanski, MEiermann, GJHoward, ADZhou, YPZhang, BBNargund, RPHagmann, WK Diamine Derivatives as Novel Small-Molecule, Potent, and Subtype-Selective Somatostatin SST3 Receptor Agonists. ACS Med Chem Lett5:690-5 (2014) 
 
Somatostatin receptor type 3
Name:Somatostatin receptor type 3
Type:Protein
Mol. Mass.:45855.97
Organism:Homo sapiens (Human)
Description:P32745
Residue:418
BDBM50021076
NameBDBM50021076
Synonyms:CHEMBL3287630
TypeSmall organic molecule
Emp. Form.C23H23Cl2N3O
Mol. Mass.428.354
SMILESClc1ccc(CN[C@H]2CCCC[C@H]2NC(=O)c2ccc3ccccc3n2)cc1Cl