Reaction Details
TargetSerine/threonine-protein kinase pim-1
LigandBDBM50021627
Substrate/Competitorn/a
Meas. Tech.ChEMBL_1368150 (CHEMBL3301295)
IC50 5471±n/a nM
Citation Casuscelli, FArdini, EAvanzi, NCasale, ECervi, GD'Anello, MDonati, DFaiardi, DFerguson, RDFogliatto, GGalvani, AMarsiglio, AMirizzi, DGMontemartini, MOrrenius, CPapeo, GPiutti, CSalom, BFelder, ER Discovery and optimization of pyrrolo[1,2-a]pyrazinones leads to novel and selective inhibitors of PIM kinases. Bioorg Med Chem21:7364-80 (2013) 
 
Serine/threonine-protein kinase pim-1
Name:Serine/threonine-protein kinase pim-1
Type:Protein
Mol. Mass.:35681.82
Organism:Homo sapiens (Human)
Description:P11309
Residue:313
BDBM50021627
NameBDBM50021627
Synonyms:CHEMBL3298402
TypeSmall organic molecule
Emp. Form.C19H24N4O2
Mol. Mass.340.4195
SMILESCC(C)(C)CNC(=O)CC1CNC(=O)c2cc(cn12)-c1ccncc1