Reaction Details
TargetSerine/threonine-protein kinase pim-1
LigandBDBM50021635
Substrate/Competitorn/a
Meas. Tech.ChEMBL_1368150 (CHEMBL3301295)
IC50 614±n/a nM
Citation Casuscelli, FArdini, EAvanzi, NCasale, ECervi, GD'Anello, MDonati, DFaiardi, DFerguson, RDFogliatto, GGalvani, AMarsiglio, AMirizzi, DGMontemartini, MOrrenius, CPapeo, GPiutti, CSalom, BFelder, ER Discovery and optimization of pyrrolo[1,2-a]pyrazinones leads to novel and selective inhibitors of PIM kinases. Bioorg Med Chem21:7364-80 (2013) 
 
Serine/threonine-protein kinase pim-1
Name:Serine/threonine-protein kinase pim-1
Type:Protein
Mol. Mass.:35681.82
Organism:Homo sapiens (Human)
Description:P11309
Residue:313
BDBM50021635
NameBDBM50021635
Synonyms:CHEMBL3298564
TypeSmall organic molecule
Emp. Form.C23H19F4N3O2
Mol. Mass.445.4095
SMILESFc1cccc(CNC(=O)CC2CNC(=O)c3cc(cn23)-c2cccc(c2)C(F)(F)F)c1