Reaction Details
TargetSerine/threonine-protein kinase pim-1
LigandBDBM50021638
Substrate/Competitorn/a
Meas. Tech.ChEMBL_1368150 (CHEMBL3301295)
IC50 124±n/a nM
Citation Casuscelli, FArdini, EAvanzi, NCasale, ECervi, GD'Anello, MDonati, DFaiardi, DFerguson, RDFogliatto, GGalvani, AMarsiglio, AMirizzi, DGMontemartini, MOrrenius, CPapeo, GPiutti, CSalom, BFelder, ER Discovery and optimization of pyrrolo[1,2-a]pyrazinones leads to novel and selective inhibitors of PIM kinases. Bioorg Med Chem21:7364-80 (2013) 
 
Serine/threonine-protein kinase pim-1
Name:Serine/threonine-protein kinase pim-1
Type:Protein
Mol. Mass.:35681.82
Organism:Homo sapiens (Human)
Description:P11309
Residue:313
BDBM50021638
NameBDBM50021638
Synonyms:CHEMBL3298819
TypeSmall organic molecule
Emp. Form.C22H26FN3O2
Mol. Mass.383.4591
SMILESFc1ccccc1-c1cc2C(=O)NCC(CC(=O)NCC3CCCCC3)n2c1