Reaction Details
TargetSerine/threonine-protein kinase pim-1
LigandBDBM50021620
Substrate/Competitorn/a
Meas. Tech.ChEMBL_1368150 (CHEMBL3301295)
IC50 2.0±n/a nM
Citation Casuscelli, FArdini, EAvanzi, NCasale, ECervi, GD'Anello, MDonati, DFaiardi, DFerguson, RDFogliatto, GGalvani, AMarsiglio, AMirizzi, DGMontemartini, MOrrenius, CPapeo, GPiutti, CSalom, BFelder, ER Discovery and optimization of pyrrolo[1,2-a]pyrazinones leads to novel and selective inhibitors of PIM kinases. Bioorg Med Chem21:7364-80 (2013) 
 
Serine/threonine-protein kinase pim-1
Name:Serine/threonine-protein kinase pim-1
Type:Protein
Mol. Mass.:35681.82
Organism:Homo sapiens (Human)
Description:P11309
Residue:313
BDBM50021620
NameBDBM50021620
Synonyms:CHEMBL3297764 | US9145418, 26
TypeSmall organic molecule
Emp. Form.C28H37ClFN5O2
Mol. Mass.530.077
SMILESCN1CCN(C[C@@H](NC(=O)C[C@H]2CNC(=O)c3cc(cn23)-c2cc(Cl)ccc2F)C2CCCCC2)CC1