Reaction Details
TargetEpidermal growth factor receptor
LigandBDBM50021703
Substrate/Competitorn/a
Meas. Tech.ChEMBL_1368552 (CHEMBL3300694)
IC50>10000±n/a nM
Citation Marzaro, GColuccia, AFerrarese, ABrun, PCastagliuolo, IConconi, MTLa Regina, GBai, RSilvestri, RHamel, EChilin, A Discovery of biarylaminoquinazolines as novel tubulin polymerization inhibitors. J Med Chem57:4598-605 (2014) 
 
Epidermal growth factor receptor
Name:Epidermal growth factor receptor
Type:Receptor Kinase Domain
Mol. Mass.:134279.59
Organism:Homo sapiens (Human)
Description:P00533
Residue:1210
BDBM50021703
NameBDBM50021703
Synonyms:CHEMBL3297956
TypeSmall organic molecule
Emp. Form.C21H17ClN4O2
Mol. Mass.392.838
SMILESCl.C1COc2cc3c(Nc4cccc(c4)-c4ccccn4)ncnc3cc2O1