Reaction Details
TargetEpidermal growth factor receptor
LigandBDBM50021705
Substrate/Competitorn/a
Meas. Tech.ChEMBL_1368552 (CHEMBL3300694)
IC50>10000±n/a nM
Citation Marzaro, GColuccia, AFerrarese, ABrun, PCastagliuolo, IConconi, MTLa Regina, GBai, RSilvestri, RHamel, EChilin, A Discovery of biarylaminoquinazolines as novel tubulin polymerization inhibitors. J Med Chem57:4598-605 (2014) 
 
Epidermal growth factor receptor
Name:Epidermal growth factor receptor
Type:Receptor Kinase Domain
Mol. Mass.:134279.59
Organism:Homo sapiens (Human)
Description:P00533
Residue:1210
BDBM50021705
NameBDBM50021705
Synonyms:CHEMBL3297958
TypeSmall organic molecule
Emp. Form.C19H14N4O2S
Mol. Mass.362.405
SMILESC1COc2cc3c(Nc4nc(cs4)-c4ccccc4)ncnc3cc2O1