Reaction Details
TargetFibroblast growth factor receptor 1
LigandBDBM50428420
Substrate/Competitorn/a
Meas. Tech.ChEMBL_1368553 (CHEMBL3300695)
IC50>10000±n/a nM
Citation Marzaro, GColuccia, AFerrarese, ABrun, PCastagliuolo, IConconi, MTLa Regina, GBai, RSilvestri, RHamel, EChilin, A Discovery of biarylaminoquinazolines as novel tubulin polymerization inhibitors. J Med Chem57:4598-605 (2014) 
 
Fibroblast growth factor receptor 1
Name:Fibroblast growth factor receptor 1
Type:Receptor
Mol. Mass.:91861.70
Organism:Homo sapiens (Human)
Description:P11362
Residue:822
BDBM50428420
NameBDBM50428420
Synonyms:CHEMBL2333991
TypeSmall organic molecule
Emp. Form.C22H19N3O2
Mol. Mass.357.4052
SMILESCOc1cc2ncnc(Nc3cccc(c3)-c3ccccc3)c2cc1OC