Reaction Details
TargetProto-oncogene tyrosine-protein kinase Src
LigandBDBM50439335
Substrate/Competitorn/a
Meas. Tech.ChEMBL_1368555 (CHEMBL3300697)
IC50 32±n/a nM
Citation Marzaro, GColuccia, AFerrarese, ABrun, PCastagliuolo, IConconi, MTLa Regina, GBai, RSilvestri, RHamel, EChilin, A Discovery of biarylaminoquinazolines as novel tubulin polymerization inhibitors. J Med Chem57:4598-605 (2014) 
 
Proto-oncogene tyrosine-protein kinase Src
Name:Proto-oncogene tyrosine-protein kinase Src
Type:Protein
Mol. Mass.:59838.60
Organism:Homo sapiens (Human)
Description:P12931
Residue:536
BDBM50439335
NameBDBM50439335
Synonyms:CHEMBL2419760
TypeSmall organic molecule
Emp. Form.C21H15N3O2
Mol. Mass.341.3627
SMILESC1Oc2cc3ncnc(Nc4cccc(c4)-c4ccccc4)c3cc2O1