Reaction Details
TargetProto-oncogene tyrosine-protein kinase Src
LigandBDBM50439334
Substrate/Competitorn/a
Meas. Tech.ChEMBL_1368555 (CHEMBL3300697)
IC50 642±n/a nM
Citation Marzaro, GColuccia, AFerrarese, ABrun, PCastagliuolo, IConconi, MTLa Regina, GBai, RSilvestri, RHamel, EChilin, A Discovery of biarylaminoquinazolines as novel tubulin polymerization inhibitors. J Med Chem57:4598-605 (2014) 
 
Proto-oncogene tyrosine-protein kinase Src
Name:Proto-oncogene tyrosine-protein kinase Src
Type:Protein
Mol. Mass.:59838.60
Organism:Homo sapiens (Human)
Description:P12931
Residue:536
BDBM50439334
NameBDBM50439334
Synonyms:CHEMBL2419761
TypeSmall organic molecule
Emp. Form.C22H17N3O2
Mol. Mass.355.3893
SMILESC1COc2cc3c(Nc4cccc(c4)-c4ccccc4)ncnc3cc2O1