Reaction Details
TargetProto-oncogene tyrosine-protein kinase Src
LigandBDBM50021702
Substrate/Competitorn/a
Meas. Tech.ChEMBL_1368555 (CHEMBL3300697)
IC50>10000±n/a nM
Citation Marzaro, GColuccia, AFerrarese, ABrun, PCastagliuolo, IConconi, MTLa Regina, GBai, RSilvestri, RHamel, EChilin, A Discovery of biarylaminoquinazolines as novel tubulin polymerization inhibitors. J Med Chem57:4598-605 (2014) 
 
Proto-oncogene tyrosine-protein kinase Src
Name:Proto-oncogene tyrosine-protein kinase Src
Type:Protein
Mol. Mass.:59838.60
Organism:Homo sapiens (Human)
Description:P12931
Residue:536
BDBM50021702
NameBDBM50021702
Synonyms:CHEMBL3297955
TypeSmall organic molecule
Emp. Form.C20H16ClN3O2S
Mol. Mass.397.878
SMILESCl.C1COc2cc3c(Nc4cccc(c4)-c4cccs4)ncnc3cc2O1