Reaction Details
TargetEpidermal growth factor receptor
LigandBDBM50022543
Substrate/Competitorn/a
Meas. Tech.ChEMBL_1368204 (CHEMBL3299340)
IC50 122±n/a nM
Citation Zhang, XRaghavan, SIhnat, MThorpe, JEDisch, BCBastian, ABailey-Downs, LCDybdal-Hargreaves, NFRohena, CCHamel, EMooberry, SLGangjee, A The design and discovery of water soluble 4-substituted-2,6-dimethylfuro[2,3-d]pyrimidines as multitargeted receptor tyrosine kinase inhibitors and microtubule targeting antitumor agents. Bioorg Med Chem22:3753-72 (2014) 
 
Epidermal growth factor receptor
Name:Epidermal growth factor receptor
Type:Receptor Kinase Domain
Mol. Mass.:134279.59
Organism:Homo sapiens (Human)
Description:P00533
Residue:1210
BDBM50022543
NameBDBM50022543
Synonyms:CHEMBL3297893
TypeSmall organic molecule
Emp. Form.C15H12F3N3O
Mol. Mass.307.2705
SMILESCc1cc2c(Nc3ccc(cc3)C(F)(F)F)nc(C)nc2o1