Reaction Details
TargetPlatelet-derived growth factor receptor beta
LigandBDBM50022543
Substrate/Competitorn/a
Meas. Tech.ChEMBL_1368206 (CHEMBL3299342)
IC50 66±n/a nM
Citation Zhang, XRaghavan, SIhnat, MThorpe, JEDisch, BCBastian, ABailey-Downs, LCDybdal-Hargreaves, NFRohena, CCHamel, EMooberry, SLGangjee, A The design and discovery of water soluble 4-substituted-2,6-dimethylfuro[2,3-d]pyrimidines as multitargeted receptor tyrosine kinase inhibitors and microtubule targeting antitumor agents. Bioorg Med Chem22:3753-72 (2014) 
 
Platelet-derived growth factor receptor beta
Name:Platelet-derived growth factor receptor beta
Type:Enzyme
Mol. Mass.:123922.25
Organism:Homo sapiens (Human)
Description:P09619
Residue:1106
BDBM50022543
NameBDBM50022543
Synonyms:CHEMBL3297893
TypeSmall organic molecule
Emp. Form.C15H12F3N3O
Mol. Mass.307.2705
SMILESCc1cc2c(Nc3ccc(cc3)C(F)(F)F)nc(C)nc2o1