Reaction Details
TargetAurora kinase A
LigandBDBM50022927
Substrate/Competitorn/a
Meas. Tech.ChEMBL_1369125
Ki 210±n/a nM
Citation Burch, JDLau, KBarker, JJBrookfield, FChen, YChen, YEigenbrot, CEllebrandt, CIsmaili, MHJohnson, AKordt, DMacKinnon, CHMcEwan, PAOrtwine, DFStein, DBWang, XWinkler, DYuen, PWZhang, YZarrin, AAPei, Z Property- and structure-guided discovery of a tetrahydroindazole series of interleukin-2 inducible T-cell kinase inhibitors. J Med Chem57:5714-27 (2014) 
 
Aurora kinase A
Name:Aurora kinase A
Type:Serine/threonine-protein kinase
Mol. Mass.:45830.98
Organism:Homo sapiens (Human)
Description:O14965
Residue:403
BDBM50022927
NameBDBM50022927
Synonyms:CHEMBL3298370
TypeSmall organic molecule
Emp. Form.C23H30N6O
Mol. Mass.406.5239
SMILESCN(C)C[C@@H](c1ccccc1)n1cc(NC(=O)c2n[nH]c3CC(C)(C)CCc23)cn1