Reaction Details
TargetAurora kinase A
LigandBDBM50022941
Substrate/Competitorn/a
Meas. Tech.ChEMBL_1369125
Ki 2000±n/a nM
Citation Burch, JDLau, KBarker, JJBrookfield, FChen, YChen, YEigenbrot, CEllebrandt, CIsmaili, MHJohnson, AKordt, DMacKinnon, CHMcEwan, PAOrtwine, DFStein, DBWang, XWinkler, DYuen, PWZhang, YZarrin, AAPei, Z Property- and structure-guided discovery of a tetrahydroindazole series of interleukin-2 inducible T-cell kinase inhibitors. J Med Chem57:5714-27 (2014) 
 
Aurora kinase A
Name:Aurora kinase A
Type:Serine/threonine-protein kinase
Mol. Mass.:45830.98
Organism:Homo sapiens (Human)
Description:O14965
Residue:403
BDBM50022941
NameBDBM50022941
Synonyms:CHEMBL3298368
TypeSmall organic molecule
Emp. Form.C19H19N5O
Mol. Mass.333.3871
SMILESO=C(Nc1cnn(Cc2ccccc2)c1)c1n[nH]c2CC3CC3Cc12