Reaction Details
TargetTyrosine-protein kinase ITK/TSK
LigandBDBM50015266
Substrate/Competitorn/a
Meas. Tech.ChEMBL_1369123
Ki 0.100000±n/a nM
Citation Burch, JDLau, KBarker, JJBrookfield, FChen, YChen, YEigenbrot, CEllebrandt, CIsmaili, MHJohnson, AKordt, DMacKinnon, CHMcEwan, PAOrtwine, DFStein, DBWang, XWinkler, DYuen, PWZhang, YZarrin, AAPei, Z Property- and structure-guided discovery of a tetrahydroindazole series of interleukin-2 inducible T-cell kinase inhibitors. J Med Chem57:5714-27 (2014) 
 
Tyrosine-protein kinase ITK/TSK
Name:Tyrosine-protein kinase ITK/TSK
Type:Protein
Mol. Mass.:71839.20
Organism:Homo sapiens (Human)
Description:Q08881
Residue:620
BDBM50015266
NameBDBM50015266
Synonyms:CHEMBL3263053
TypeSmall organic molecule
Emp. Form.C25H26N8O
Mol. Mass.454.5269
SMILESCN(C)CC[C@@H](c1ccccc1)n1cc(NC(=O)c2n[nH]c3cc(ccc23)-c2cn[nH]c2)cn1