Reaction Details
TargetTyrosine-protein kinase ITK/TSK
LigandBDBM50022937
Substrate/Competitorn/a
Meas. Tech.ChEMBL_1369123
Ki 8.0±n/a nM
Citation Burch, JDLau, KBarker, JJBrookfield, FChen, YChen, YEigenbrot, CEllebrandt, CIsmaili, MHJohnson, AKordt, DMacKinnon, CHMcEwan, PAOrtwine, DFStein, DBWang, XWinkler, DYuen, PWZhang, YZarrin, AAPei, Z Property- and structure-guided discovery of a tetrahydroindazole series of interleukin-2 inducible T-cell kinase inhibitors. J Med Chem57:5714-27 (2014) 
 
Tyrosine-protein kinase ITK/TSK
Name:Tyrosine-protein kinase ITK/TSK
Type:Protein
Mol. Mass.:71839.20
Organism:Homo sapiens (Human)
Description:Q08881
Residue:620
BDBM50022937
NameBDBM50022937
Synonyms:CHEMBL3298293
TypeSmall organic molecule
Emp. Form.C20H23N5O2
Mol. Mass.365.4289
SMILESCC1(CO)CCc2c(C1)[nH]nc2C(=O)Nc1cnn(Cc2ccccc2)c1