Reaction Details
TargetAurora kinase A
LigandBDBM50023033
Substrate/Competitorn/a
Meas. Tech.ChEMBL_1369125
Ki>5700±n/a nM
Citation Burch, JDLau, KBarker, JJBrookfield, FChen, YChen, YEigenbrot, CEllebrandt, CIsmaili, MHJohnson, AKordt, DMacKinnon, CHMcEwan, PAOrtwine, DFStein, DBWang, XWinkler, DYuen, PWZhang, YZarrin, AAPei, Z Property- and structure-guided discovery of a tetrahydroindazole series of interleukin-2 inducible T-cell kinase inhibitors. J Med Chem57:5714-27 (2014) 
 
Aurora kinase A
Name:Aurora kinase A
Type:Serine/threonine-protein kinase
Mol. Mass.:45830.98
Organism:Homo sapiens (Human)
Description:O14965
Residue:403
BDBM50023033
NameBDBM50023033
Synonyms:CHEMBL3298367
TypeSmall organic molecule
Emp. Form.C21H23N5O2
Mol. Mass.377.4396
SMILESO=C(Nc1cnn(Cc2ccccc2)c1)c1n[nH]c2CC3(CCOC3)CCc12