Reaction Details
TargetTyrosine-protein kinase ITK/TSK
LigandBDBM50022927
Substrate/Competitorn/a
Meas. Tech.ChEMBL_1369123
Ki 0.800000±n/a nM
Citation Burch, JDLau, KBarker, JJBrookfield, FChen, YChen, YEigenbrot, CEllebrandt, CIsmaili, MHJohnson, AKordt, DMacKinnon, CHMcEwan, PAOrtwine, DFStein, DBWang, XWinkler, DYuen, PWZhang, YZarrin, AAPei, Z Property- and structure-guided discovery of a tetrahydroindazole series of interleukin-2 inducible T-cell kinase inhibitors. J Med Chem57:5714-27 (2014) 
 
Tyrosine-protein kinase ITK/TSK
Name:Tyrosine-protein kinase ITK/TSK
Type:Protein
Mol. Mass.:71839.20
Organism:Homo sapiens (Human)
Description:Q08881
Residue:620
BDBM50022927
NameBDBM50022927
Synonyms:CHEMBL3298370
TypeSmall organic molecule
Emp. Form.C23H30N6O
Mol. Mass.406.5239
SMILESCN(C)C[C@@H](c1ccccc1)n1cc(NC(=O)c2n[nH]c3CC(C)(C)CCc23)cn1