Reaction Details
TargetLysophosphatidic acid receptor 1
LigandBDBM50023469
Substrate/Competitorn/a
Meas. Tech.ChEMBL_1452484 (CHEMBL3362833)
IC50 825±n/a nM
Citation Sidduri, ABudd, DCFuentes, MELambros, TRen, YRoongta, VSchoenfeld, RCGillespie, PStevenson, CSTruitt, TQian, Y Discovery of novel non-carboxylic acid 5-amino-4-cyanopyrazole derivatives as potent and highly selective LPA1R antagonists. Bioorg Med Chem Lett24:4450-4 (2014) 
 
Lysophosphatidic acid receptor 1
Name:Lysophosphatidic acid receptor 1
Type:Enzyme
Mol. Mass.:41120.55
Organism:Homo sapiens (Human)
Description:Q92633
Residue:364
BDBM50023469
NameBDBM50023469
Synonyms:CHEMBL3326532
TypeSmall organic molecule
Emp. Form.C21H23N5O2
Mol. Mass.377.4396
SMILESCOc1cc2CCCc2cc1C(=O)C(=N/C1CCCC1)\n1ncc(C#N)c1N