Reaction Details
TargetVoltage-dependent L-type calcium channel subunit alpha-1C
LigandBDBM50395399
Substrate/Competitorn/a
Meas. Tech.ChEMBL_1454249 (CHEMBL3363799)
IC50 92000±n/a nM
Citation Reck, FEhmann, DEDougherty, TJNewman, JVHopkins, SStone, GAgrawal, NCiaccio, PMcNulty, JBarthlow, HO'Donnell, JGoteti, KBreen, JComita-Prevoir, JCornebise, MCronin, MEyermann, CJGeng, BCarr, GRPandarinathan, LTang, XCottone, AZhao, LBezdenejnih-Snyder, N Optimization of physicochemical properties and safety profile of novel bacterial topoisomerase type II inhibitors (NBTIs) with activity against Pseudomonas aeruginosa. Bioorg Med Chem22:5392-409 (2014) 
 
Voltage-dependent L-type calcium channel subunit alpha-1C
Name:Voltage-dependent L-type calcium channel subunit alpha-1C
Type:Enzyme Catalytic Domain
Mol. Mass.:248979.79
Organism:Homo sapiens (Human)
Description:Calcium channel (Type L) 0 HUMAN::Q13936
Residue:2221
BDBM50395399
NameBDBM50395399
Synonyms:CHEMBL2165063
TypeSmall organic molecule
Emp. Form.C24H28N6O4
Mol. Mass.464.5169
SMILESCOc1ccc2ncc(=O)n(CCN3CCC(CC3)NCc3ccc4OCC(=O)Nc4n3)c2c1