Reaction Details
TargetPotassium voltage-gated channel subfamily KQT member 1
LigandBDBM50395399
Substrate/Competitorn/a
Meas. Tech.ChEMBL_1454245 (CHEMBL3363795)
IC50 35000±n/a nM
Citation Reck, FEhmann, DEDougherty, TJNewman, JVHopkins, SStone, GAgrawal, NCiaccio, PMcNulty, JBarthlow, HO'Donnell, JGoteti, KBreen, JComita-Prevoir, JCornebise, MCronin, MEyermann, CJGeng, BCarr, GRPandarinathan, LTang, XCottone, AZhao, LBezdenejnih-Snyder, N Optimization of physicochemical properties and safety profile of novel bacterial topoisomerase type II inhibitors (NBTIs) with activity against Pseudomonas aeruginosa. Bioorg Med Chem22:5392-409 (2014) 
 
Potassium voltage-gated channel subfamily KQT member 1
Name:Potassium voltage-gated channel subfamily KQT member 1
Type:PROTEIN
Mol. Mass.:74739.00
Organism:Homo sapiens (Human)
Description:ChEMBL_1454245
Residue:676
BDBM50395399
NameBDBM50395399
Synonyms:CHEMBL2165063
TypeSmall organic molecule
Emp. Form.C24H28N6O4
Mol. Mass.464.5169
SMILESCOc1ccc2ncc(=O)n(CCN3CCC(CC3)NCc3ccc4OCC(=O)Nc4n3)c2c1