Reaction Details
TargetSodium channel protein type 5 subunit alpha
LigandBDBM50023589
Substrate/Competitorn/a
Meas. Tech.ChEMBL_1454248 (CHEMBL3363798)
IC50>333000±n/a nM
Citation Reck, FEhmann, DEDougherty, TJNewman, JVHopkins, SStone, GAgrawal, NCiaccio, PMcNulty, JBarthlow, HO'Donnell, JGoteti, KBreen, JComita-Prevoir, JCornebise, MCronin, MEyermann, CJGeng, BCarr, GRPandarinathan, LTang, XCottone, AZhao, LBezdenejnih-Snyder, N Optimization of physicochemical properties and safety profile of novel bacterial topoisomerase type II inhibitors (NBTIs) with activity against Pseudomonas aeruginosa. Bioorg Med Chem22:5392-409 (2014) 
 
Sodium channel protein type 5 subunit alpha
Name:Sodium channel protein type 5 subunit alpha
Type:Enzyme
Mol. Mass.:226908.60
Organism:Homo sapiens (Human)
Description:Q14524
Residue:2016
BDBM50023589
NameBDBM50023589
Synonyms:CHEMBL3355573
TypeSmall organic molecule
Emp. Form.C23H26FN7O3
Mol. Mass.467.496
SMILES[H][C@@]1(CC[C@@H](CC1)NCc1ncc2OCC(=O)Nc2n1)[C@@H](N)Cn1c2cc(F)ccc2ncc1=O