Reaction Details
TargetSodium channel protein type 9 subunit alpha
LigandBDBM50024135
Substrate/Competitorn/a
Meas. Tech.ChEMBL_1435223 (CHEMBL3390669)
IC50 32±n/a nM
Citation Sun, SJia, QZenova, AYChafeev, MZhang, ZLin, SKwan, RGrimwood, MEChowdhury, SYoung, CCohen, CJOballa, RM The discovery of benzenesulfonamide-based potent and selective inhibitors of voltage-gated sodium channel Na(v)1.7. Bioorg Med Chem Lett24:4397-401 (2014) 
 
Sodium channel protein type 9 subunit alpha
Name:Sodium channel protein type 9 subunit alpha
Type:Protein
Mol. Mass.:226375.97
Organism:Homo sapiens (Human)
Description:Q15858
Residue:1988
BDBM50024135
NameBDBM50024135
Synonyms:CHEMBL3325532
TypeSmall organic molecule
Emp. Form.C20H19F3N4O3S2
Mol. Mass.484.515
SMILESFc1ccc(cc1)[C@@H]1CNCC[C@H]1COc1cc(F)c(cc1F)S(=O)(=O)Nc1ncns1