Reaction Details
TargetSodium channel protein type 9 subunit alpha
LigandBDBM50024242
Substrate/Competitorn/a
Meas. Tech.ChEMBL_1435223 (CHEMBL3390669)
IC50 11±n/a nM
Citation Sun, SJia, QZenova, AYChafeev, MZhang, ZLin, SKwan, RGrimwood, MEChowdhury, SYoung, CCohen, CJOballa, RM The discovery of benzenesulfonamide-based potent and selective inhibitors of voltage-gated sodium channel Na(v)1.7. Bioorg Med Chem Lett24:4397-401 (2014) 
 
Sodium channel protein type 9 subunit alpha
Name:Sodium channel protein type 9 subunit alpha
Type:Protein
Mol. Mass.:226375.97
Organism:Homo sapiens (Human)
Description:Q15858
Residue:1988
BDBM50024242
NameBDBM50024242
Synonyms:CHEMBL3325551
TypeSmall organic molecule
Emp. Form.C22H20ClF3N4O3S
Mol. Mass.512.932
SMILESFc1cnc(NS(=O)(=O)c2cc(F)c(OC[C@H]3CNCC[C@@H]3c3ccc(Cl)cc3)cc2F)nc1