Reaction Details
TargetSodium channel protein type 5 subunit alpha
LigandBDBM50024132
Substrate/Competitorn/a
Meas. Tech.ChEMBL_1435224 (CHEMBL3390670)
IC50>10000±n/a nM
Citation Sun, SJia, QZenova, AYChafeev, MZhang, ZLin, SKwan, RGrimwood, MEChowdhury, SYoung, CCohen, CJOballa, RM The discovery of benzenesulfonamide-based potent and selective inhibitors of voltage-gated sodium channel Na(v)1.7. Bioorg Med Chem Lett24:4397-401 (2014) 
 
Sodium channel protein type 5 subunit alpha
Name:Sodium channel protein type 5 subunit alpha
Type:Enzyme
Mol. Mass.:226908.60
Organism:Homo sapiens (Human)
Description:Q14524
Residue:2016
BDBM50024132
NameBDBM50024132
Synonyms:CHEMBL3325530 | US9630929, Example 47
TypeSmall organic molecule
Emp. Form.C20H18F4N4O3S2
Mol. Mass.502.506
SMILESFc1ccc(cc1)C1CCNCC1(F)COc1cc(F)c(cc1F)S(=O)(=O)Nc1ncns1