Reaction Details
TargetSodium channel protein type 5 subunit alpha
LigandBDBM50024135
Substrate/Competitorn/a
Meas. Tech.ChEMBL_1435224 (CHEMBL3390670)
IC50 5900±n/a nM
Citation Sun, SJia, QZenova, AYChafeev, MZhang, ZLin, SKwan, RGrimwood, MEChowdhury, SYoung, CCohen, CJOballa, RM The discovery of benzenesulfonamide-based potent and selective inhibitors of voltage-gated sodium channel Na(v)1.7. Bioorg Med Chem Lett24:4397-401 (2014) 
 
Sodium channel protein type 5 subunit alpha
Name:Sodium channel protein type 5 subunit alpha
Type:Enzyme
Mol. Mass.:226908.60
Organism:Homo sapiens (Human)
Description:Q14524
Residue:2016
BDBM50024135
NameBDBM50024135
Synonyms:CHEMBL3325532
TypeSmall organic molecule
Emp. Form.C20H19F3N4O3S2
Mol. Mass.484.515
SMILESFc1ccc(cc1)[C@@H]1CNCC[C@H]1COc1cc(F)c(cc1F)S(=O)(=O)Nc1ncns1