Reaction Details
TargetAcetylcholinesterase
LigandBDBM50024886
Substrate/Competitorn/a
Meas. Tech.ChEMBL_1439641 (CHEMBL3383711)
IC50 8700±n/a nM
Citation Gulcan, HOUnlu, SEsiringu, IErcetin, TSahin, YOz, DSahin, MF Design, synthesis and biological evaluation of novel 6H-benzo[c]chromen-6-one, and 7,8,9,10-tetrahydro-benzo[c]chromen-6-one derivatives as potential cholinesterase inhibitors. Bioorg Med Chem22:5141-54 (2014) 
 
Acetylcholinesterase
Name:Acetylcholinesterase
Type:Enzyme
Mol. Mass.:67792.70
Organism:Homo sapiens (Human)
Description:P22303
Residue:614
BDBM50024886
NameBDBM50024886
Synonyms:CHEMBL3335055
TypeSmall organic molecule
Emp. Form.C29H36N2O4
Mol. Mass.476.6071
SMILESCOc1cccc(CN2CCN(CCCCOc3ccc4c5CCCCc5c(=O)oc4c3)CC2)c1