Reaction Details
TargetAcetylcholinesterase
LigandBDBM50024897
Substrate/Competitorn/a
Meas. Tech.ChEMBL_1439641 (CHEMBL3383711)
IC50 2700±n/a nM
Citation Gulcan, HOUnlu, SEsiringu, IErcetin, TSahin, YOz, DSahin, MF Design, synthesis and biological evaluation of novel 6H-benzo[c]chromen-6-one, and 7,8,9,10-tetrahydro-benzo[c]chromen-6-one derivatives as potential cholinesterase inhibitors. Bioorg Med Chem22:5141-54 (2014) 
 
Acetylcholinesterase
Name:Acetylcholinesterase
Type:Enzyme
Mol. Mass.:67792.70
Organism:Homo sapiens (Human)
Description:P22303
Residue:614
BDBM50024897
NameBDBM50024897
Synonyms:CHEMBL3335032
TypeSmall organic molecule
Emp. Form.C25H29NO4
Mol. Mass.407.5021
SMILESCOc1cccc(CN(C)CCCOc2ccc3c4CCCCc4c(=O)oc3c2)c1