Reaction Details
TargetAcetylcholinesterase
LigandBDBM50024898
Substrate/Competitorn/a
Meas. Tech.ChEMBL_1439641 (CHEMBL3383711)
IC50 2100±n/a nM
Citation Gulcan, HOUnlu, SEsiringu, IErcetin, TSahin, YOz, DSahin, MF Design, synthesis and biological evaluation of novel 6H-benzo[c]chromen-6-one, and 7,8,9,10-tetrahydro-benzo[c]chromen-6-one derivatives as potential cholinesterase inhibitors. Bioorg Med Chem22:5141-54 (2014) 
 
Acetylcholinesterase
Name:Acetylcholinesterase
Type:Enzyme
Mol. Mass.:67792.70
Organism:Homo sapiens (Human)
Description:P22303
Residue:614
BDBM50024898
NameBDBM50024898
Synonyms:CHEMBL3335031
TypeSmall organic molecule
Emp. Form.C24H27NO3
Mol. Mass.377.4761
SMILESCN(CCCOc1ccc2c3CCCCc3c(=O)oc2c1)Cc1ccccc1