Reaction Details
TargetCasein kinase I isoform delta
LigandBDBM50025019
Substrate/Competitorn/a
Meas. Tech.ChEMBL_1440405 (CHEMBL3386218)
IC50 70±n/a nM
Citation Richter, JBischof, JZaja, MKohlhof, HOthersen, OVitt, DAlscher, VPospiech, IGarcía-Reyes, BBerg, SLeban, JKnippschild, U Difluoro-dioxolo-benzoimidazol-benzamides as potent inhibitors of CK1d ande with nanomolar inhibitory activity on cancer cell proliferation. J Med Chem57:7933-46 (2014) 
 
Casein kinase I isoform delta
Name:Casein kinase I isoform delta
Type:Enzyme
Mol. Mass.:47342.73
Organism:Rattus norvegicus (rat)
Description:Q06486
Residue:415
BDBM50025019
NameBDBM50025019
Synonyms:CHEMBL3337845
TypeSmall organic molecule
Emp. Form.C20H10F5N5O5S
Mol. Mass.527.381
SMILESFC(F)(F)Oc1ccccc1C(=O)Nc1nc(cs1)C(=O)Nc1nc2cc3OC(F)(F)Oc3cc2[nH]1