Reaction Details
TargetCasein kinase I isoform delta
LigandBDBM50025015
Substrate/Competitorn/a
Meas. Tech.ChEMBL_1440404 (CHEMBL3386217)
IC50 170±n/a nM
Citation Richter, JBischof, JZaja, MKohlhof, HOthersen, OVitt, DAlscher, VPospiech, IGarcía-Reyes, BBerg, SLeban, JKnippschild, U Difluoro-dioxolo-benzoimidazol-benzamides as potent inhibitors of CK1d ande with nanomolar inhibitory activity on cancer cell proliferation. J Med Chem57:7933-46 (2014) 
 
Casein kinase I isoform delta
Name:Casein kinase I isoform delta
Type:Enzyme
Mol. Mass.:47342.73
Organism:Rattus norvegicus (rat)
Description:Q06486
Residue:415
BDBM50025015
NameBDBM50025015
Synonyms:CHEMBL3337846
TypeSmall organic molecule
Emp. Form.C16H11F2N3O4
Mol. Mass.347.273
SMILESCOc1cccc(c1)C(=O)Nc1nc2cc3OC(F)(F)Oc3cc2[nH]1