Reaction Details
TargetCasein kinase I isoform delta
LigandBDBM50025024
Substrate/Competitorn/a
Meas. Tech.ChEMBL_1440400 (CHEMBL3386213)
IC50 130±n/a nM
Citation Richter, JBischof, JZaja, MKohlhof, HOthersen, OVitt, DAlscher, VPospiech, IGarcía-Reyes, BBerg, SLeban, JKnippschild, U Difluoro-dioxolo-benzoimidazol-benzamides as potent inhibitors of CK1d ande with nanomolar inhibitory activity on cancer cell proliferation. J Med Chem57:7933-46 (2014) 
 
Casein kinase I isoform delta
Name:Casein kinase I isoform delta
Type:Enzyme
Mol. Mass.:47342.73
Organism:Rattus norvegicus (rat)
Description:Q06486
Residue:415
BDBM50025024
NameBDBM50025024
Synonyms:CHEMBL3337850
TypeSmall organic molecule
Emp. Form.C16H13F2N5O3
Mol. Mass.361.3029
SMILESCN(C)c1cc(ccn1)C(=O)Nc1nc2cc3OC(F)(F)Oc3cc2[nH]1