Reaction Details
TargetHistone deacetylase 1
LigandBDBM50026432
Substrate/Competitorn/a
Meas. Tech.ChEMBL_1433877 (CHEMBL3388838)
IC50 145±n/a nM
Citation Yao, YLiao, CLi, ZWang, ZSun, QLiu, CYang, YTu, ZJiang, S Design, synthesis, and biological evaluation of 1, 3-disubstituted-pyrazole derivatives as new class I and IIb histone deacetylase inhibitors. Eur J Med Chem86:639-52 (2014) 
 
Histone deacetylase 1
Name:Histone deacetylase 1
Type:Enzyme
Mol. Mass.:55090.27
Organism:Homo sapiens (Human)
Description:Q13547
Residue:482
BDBM50026432
NameBDBM50026432
Synonyms:CHEMBL3335301
TypeSmall organic molecule
Emp. Form.C21H24N4O2
Mol. Mass.364.4409
SMILESONC(=O)CCCCc1ccn(Cc2cccc(Nc3ccccc3)c2)n1