Reaction Details
TargetHistone deacetylase 1
LigandBDBM50026436
Substrate/Competitorn/a
Meas. Tech.ChEMBL_1433877 (CHEMBL3388838)
IC50 293±n/a nM
Citation Yao, YLiao, CLi, ZWang, ZSun, QLiu, CYang, YTu, ZJiang, S Design, synthesis, and biological evaluation of 1, 3-disubstituted-pyrazole derivatives as new class I and IIb histone deacetylase inhibitors. Eur J Med Chem86:639-52 (2014) 
 
Histone deacetylase 1
Name:Histone deacetylase 1
Type:Enzyme
Mol. Mass.:55090.27
Organism:Homo sapiens (Human)
Description:Q13547
Residue:482
BDBM50026436
NameBDBM50026436
Synonyms:CHEMBL3335295
TypeSmall organic molecule
Emp. Form.C15H18FN3O2
Mol. Mass.291.3207
SMILESONC(=O)CCCCc1ccn(Cc2ccc(F)cc2)n1