Reaction Details
TargetHistone deacetylase 7
LigandBDBM50026466
Substrate/Competitorn/a
Meas. Tech.ChEMBL_1433883 (CHEMBL3388844)
IC50 5600±n/a nM
Citation Yao, YLiao, CLi, ZWang, ZSun, QLiu, CYang, YTu, ZJiang, S Design, synthesis, and biological evaluation of 1, 3-disubstituted-pyrazole derivatives as new class I and IIb histone deacetylase inhibitors. Eur J Med Chem86:639-52 (2014) 
 
Histone deacetylase 7
Name:Histone deacetylase 7
Type:Chromatin regulator; hydrolase; repressor
Mol. Mass.:102942.62
Organism:Homo sapiens (Human)
Description:Q8WUI4
Residue:952
BDBM50026466
NameBDBM50026466
Synonyms:CHEMBL3335311
TypeSmall organic molecule
Emp. Form.C22H25N3O2
Mol. Mass.363.4528
SMILESONC(=O)CCCCCc1ccn(Cc2ccc(cc2)-c2ccccc2)n1